Target
Transient receptor potential cation channel subfamily M member 1
Ligand
BDBM20488
Substrate
Meas. Tech.
ChEMBL_2126014 (CHEMBL4835359)
IC50
6.0±n/a nM
Citation
 Zhang, HYu, PLin, HJin, ZZhao, SZhang, YXu, QJin, HLiu, ZYang, WZhang, L The Discovery of Novel ACA Derivatives as Specific TRPM2 Inhibitors that Reduce Ischemic Injury Both In Vitro and In Vivo. J Med Chem 64:3976-3996 (2021)  
Target
Name:
Transient receptor potential cation channel subfamily M member 1
Synonyms:
Long transient receptor potential channel 1 Melastatin-1 Transient receptor potential cation channel subfamily M member 1 | Trpm1
Type:
PROTEIN
Mol. Mass.:
183547.05
Organism:
Mus musculus
Description:
ChEMBL_120424
Residue:
1622
  
Inhibitor
Name:
BDBM20488
Synonyms:
(2E)-3-(4-chlorophenyl)-N-(3-methoxyphenyl)prop-2-enamide | SB-366791
Type:
Small organic molecule
Emp. Form.:
C16H14ClNO2
Mol. Mass.:
287.741
SMILES:
COc1cccc(NC(=O)\C=C\c2ccc(Cl)cc2)c1
: