Target
C-C chemokine receptor type 3
Ligand
BDBM50142454
Substrate
Meas. Tech.
ChEBML_39489
IC50
56±n/a nM
Citation
 Varnes, JGGardner, DSSantella, JBDuncia, JVEstrella, MWatson, PSClark, CMKo, SSWelch, PCovington, MStowell, NWadman, EDavies, PSolomon, KNewton, RCTrainor, GLDecicco, CPWacker, DA Discovery of N-propylurea 3-benzylpiperidines as selective CC chemokine receptor-3 (CCR3) antagonists. Bioorg Med Chem Lett 14:1645-9 (2004)  
Target
Name:
C-C chemokine receptor type 3
Synonyms:
C-C CKR-3 CC-CKR-3 CCR3 CD_antigen=CD193 CMKBR3 | Eosinophil eotaxin receptor
Type:
Enzyme
Mol. Mass.:
41053.88
Organism:
Homo sapiens (Human)
Description:
P51677
Residue:
355
  
Inhibitor
Name:
BDBM50142454
Synonyms:
1-(3-Acetyl-phenyl)-3-[3-((3aR,9aS)-6-fluoro-1,3,3a,4,9,9a-hexahydro-benzo[f]isoindol-2-yl)-propyl]-urea | CHEMBL45064
Type:
Small organic molecule
Emp. Form.:
C24H28FN3O2
Mol. Mass.:
409.4964
SMILES:
CC(=O)c1cccc(NC(=O)NCCCN2C[C@H]3Cc4ccc(F)cc4C[C@H]3C2)c1
: