Target
C-C chemokine receptor type 3
Ligand
BDBM50142455
Substrate
Meas. Tech.
ChEBML_39489
IC50
19±n/a nM
Citation
 Varnes, JGGardner, DSSantella, JBDuncia, JVEstrella, MWatson, PSClark, CMKo, SSWelch, PCovington, MStowell, NWadman, EDavies, PSolomon, KNewton, RCTrainor, GLDecicco, CPWacker, DA Discovery of N-propylurea 3-benzylpiperidines as selective CC chemokine receptor-3 (CCR3) antagonists. Bioorg Med Chem Lett 14:1645-9 (2004)  
Target
Name:
C-C chemokine receptor type 3
Synonyms:
C-C CKR-3 CC-CKR-3 CCR3 CD_antigen=CD193 CMKBR3 | Eosinophil eotaxin receptor
Type:
Enzyme
Mol. Mass.:
41053.88
Organism:
Homo sapiens (Human)
Description:
P51677
Residue:
355
  
Inhibitor
Name:
BDBM50142455
Synonyms:
1-(3-Cyano-phenyl)-3-{3-[3-(2,4-difluoro-benzyl)-piperidin-1-yl]-propyl}-urea | CHEMBL42264
Type:
Small organic molecule
Emp. Form.:
C23H26F2N4O
Mol. Mass.:
412.4755
SMILES:
Fc1ccc(CC2CCCN(CCCNC(=O)Nc3cccc(c3)C#N)C2)c(F)c1
: