Target
C-C chemokine receptor type 3
Ligand
BDBM50142464
Substrate
Meas. Tech.
ChEBML_39489
IC50
31±n/a nM
Citation
 Varnes, JGGardner, DSSantella, JBDuncia, JVEstrella, MWatson, PSClark, CMKo, SSWelch, PCovington, MStowell, NWadman, EDavies, PSolomon, KNewton, RCTrainor, GLDecicco, CPWacker, DA Discovery of N-propylurea 3-benzylpiperidines as selective CC chemokine receptor-3 (CCR3) antagonists. Bioorg Med Chem Lett 14:1645-9 (2004)  
Target
Name:
C-C chemokine receptor type 3
Synonyms:
C-C CKR-3 CC-CKR-3 CCR3 CD_antigen=CD193 CMKBR3 | Eosinophil eotaxin receptor
Type:
Enzyme
Mol. Mass.:
41053.88
Organism:
Homo sapiens (Human)
Description:
P51677
Residue:
355
  
Inhibitor
Name:
BDBM50142464
Synonyms:
1-(3-Cyano-phenyl)-3-{3-[3-(4-fluoro-benzyl)-pyrrolidin-1-yl]-propyl}-urea | CHEMBL42507
Type:
Small organic molecule
Emp. Form.:
C22H25FN4O
Mol. Mass.:
380.4585
SMILES:
Fc1ccc(CC2CCN(CCCNC(=O)Nc3cccc(c3)C#N)C2)cc1
: