Target
C-C chemokine receptor type 3
Ligand
BDBM50142446
Substrate
Meas. Tech.
ChEBML_39489
IC50
3.6±n/a nM
Citation
 Varnes, JGGardner, DSSantella, JBDuncia, JVEstrella, MWatson, PSClark, CMKo, SSWelch, PCovington, MStowell, NWadman, EDavies, PSolomon, KNewton, RCTrainor, GLDecicco, CPWacker, DA Discovery of N-propylurea 3-benzylpiperidines as selective CC chemokine receptor-3 (CCR3) antagonists. Bioorg Med Chem Lett 14:1645-9 (2004)  
Target
Name:
C-C chemokine receptor type 3
Synonyms:
C-C CKR-3 CC-CKR-3 CCR3 CD_antigen=CD193 CMKBR3 | Eosinophil eotaxin receptor
Type:
Enzyme
Mol. Mass.:
41053.88
Organism:
Homo sapiens (Human)
Description:
P51677
Residue:
355
  
Inhibitor
Name:
BDBM50142446
Synonyms:
1-{3-[(S)-3-(4-Fluoro-benzyl)-piperidin-1-yl]-propyl}-3-(3-[1,3,4]oxadiazol-2-yl-phenyl)-urea | CHEMBL42562
Type:
Small organic molecule
Emp. Form.:
C24H28FN5O2
Mol. Mass.:
437.5098
SMILES:
Fc1ccc(C[C@@H]2CCCN(CCCNC(=O)Nc3cccc(c3)-c3nnco3)C2)cc1
: