Target
Immunoglobulin lambda variable 6-57
Ligand
BDBM50576195
Substrate
Meas. Tech.
ChEMBL_2126711 (CHEMBL4836056)
EC50
28±n/a nM
Citation
 Yan, NLSantos-Martins, DNair, RChu, AWilson, IAJohnson, KAForli, SMorgan, GJPetrassi, HMKelly, JW Discovery of Potent Coumarin-Based Kinetic Stabilizers of Amyloidogenic Immunoglobulin Light Chains Using Structure-Based Design. J Med Chem 64:6273-6299 (2021)  
Target
Name:
Immunoglobulin lambda variable 6-57
Synonyms:
IGLV6-57 Ig lambda chain V-VI region EB4 Ig lambda chain V-VI region SUT Immunoglobulin lambda variable 6-57 | LV657_HUMAN
Type:
PROTEIN
Mol. Mass.:
12561.55
Organism:
Homo sapiens
Description:
ChEMBL_120180
Residue:
117
  
Inhibitor
Name:
BDBM50576195
Synonyms:
CHEMBL4855805
Type:
Small organic molecule
Emp. Form.:
C27H30N4O4
Mol. Mass.:
474.5515
SMILES:
CCN(CC)c1ccc2c(C)c(CCOC(=O)NCc3cccc(c3)-c3c[nH]cn3)c(=O)oc2c1
: