Target
Prostaglandin G/H synthase 1
Ligand
BDBM22369
Substrate
Meas. Tech.
ChEBML_159283
IC50
>500000±n/a nM
Citation
 Zarghi, APraveen Rao, PNKnaus, EE Sulfonamido, azidosulfonyl and N-acetylsulfonamido analogues of rofecoxib: 4-[4-(N-acetylsulfonamido)phenyl]-3-(4-methanesulfonylphenyl)-2(5H)furanone is a potent and selective cyclooxygenase-2 inhibitor. Bioorg Med Chem Lett 14:1957-60 (2004)  
Target
Name:
Prostaglandin G/H synthase 1
Synonyms:
COX1 Cyclooxygenase-1 (COX-1) PTGS1 | Prostaglandin G/H synthase (cyclooxygenase)
Type:
Protein
Mol. Mass.:
68868.60
Organism:
Ovis aries (Sheep)
Description:
Residue:
600
  
Inhibitor
Name:
BDBM22369
Synonyms:
4-(4-methanesulfonylphenyl)-3-phenyl-2,5-dihydrofuran-2-one MK 0966 US11478464, Compound Rofecoxib | US11786535, Compound Rofecoxib
Type:
Small organic molecule
Emp. Form.:
C17H14O4S
Mol. Mass.:
314.356
SMILES:
CS(=O)(=O)c1ccc(cc1)C1=C(C(=O)OC1)c1ccccc1
: