Target
Envelope phospholipase F13
Ligand
BDBM50577047
Substrate
Meas. Tech.
ChEMBL_2128845 (CHEMBL4838274)
IC50
3060±n/a nM
Citation
 Shiryaev, VASkomorohov, MYLeonova, MVBormotov, NISerova, OAShishkina, LNAgafonov, APMaksyutov, RAKlimochkin, YN Adamantane derivatives as potential inhibitors of p37 major envelope protein and poxvirus reproduction. Design, synthesis and antiviral activity. Eur J Med Chem 221:0 (2021)  
Target
Name:
Envelope phospholipase F13
Synonyms:
3.1.1.- Envelope phospholipase F13 PG057_VACCW p37K
Type:
PROTEIN
Mol. Mass.:
41798.24
Organism:
Vaccinia virus (strain Western Reserve) (VACV) (Vaccinia virus (strainWR))
Description:
ChEMBL_118391
Residue:
372
  
Inhibitor
Name:
BDBM50577047
Synonyms:
CHEMBL4865942
Type:
Small organic molecule
Emp. Form.:
C17H20BrNO
Mol. Mass.:
334.251
SMILES:
Brc1ccc(cc1)C(=O)NC1C2CC3CC(C2)CC1C3
: