Target
Envelope phospholipase F13
Ligand
BDBM50577051
Substrate
Meas. Tech.
ChEMBL_2128845 (CHEMBL4838274)
IC50
12530±n/a nM
Citation
 Shiryaev, VASkomorohov, MYLeonova, MVBormotov, NISerova, OAShishkina, LNAgafonov, APMaksyutov, RAKlimochkin, YN Adamantane derivatives as potential inhibitors of p37 major envelope protein and poxvirus reproduction. Design, synthesis and antiviral activity. Eur J Med Chem 221:0 (2021)  
Target
Name:
Envelope phospholipase F13
Synonyms:
3.1.1.- Envelope phospholipase F13 PG057_VACCW p37K
Type:
PROTEIN
Mol. Mass.:
41798.24
Organism:
Vaccinia virus (strain Western Reserve) (VACV) (Vaccinia virus (strainWR))
Description:
ChEMBL_118391
Residue:
372
  
Inhibitor
Name:
BDBM50577051
Synonyms:
CHEMBL4865823
Type:
Small organic molecule
Emp. Form.:
C21H25F3N2O2
Mol. Mass.:
394.4306
SMILES:
CCC12CC3CC(C1)CC(C3)(C2)C(=O)NNC(=O)c1ccc(cc1)C(F)(F)F
: