Target
Fibroblast growth factor 2
Ligand
BDBM50577061
Substrate
Meas. Tech.
ChEMBL_2129136 (CHEMBL4838565)
Kd
30000±n/a nM
Citation
 Castelli, RTaranto, SFuriassi, LBozza, NMarseglia, GFerlenghi, FRivara, SRetini, MBedini, ASpadoni, GMatarazzo, SRonca, RPresta, MMor, MGiacomini, A Chemical modification of NSC12 leads to a specific FGF-trap with antitumor activity in multiple myeloma. Eur J Med Chem 221:0 (2021)  
Target
Name:
Fibroblast growth factor 2
Synonyms:
Basic fibroblast growth factor FGF2 FGFB Fibroblast growth factor receptor 2 (FGF-2) Heparin-binding growth factor 2
Type:
Protein
Mol. Mass.:
30803.89
Organism:
Homo sapiens (Human)
Description:
P09038
Residue:
288
  
Inhibitor
Name:
BDBM50577061
Synonyms:
CHEMBL4860807
Type:
Small organic molecule
Emp. Form.:
C26H37F6NO4
Mol. Mass.:
541.5667
SMILES:
[H][C@@]1(CC[C@@]2([H])[C@]3([H])CC=C4C[C@H](CC[C@]4(C)[C@@]3([H])CC[C@]12C)OC(=O)CN)[C@H](O)CC(O)(C(F)(F)F)C(F)(F)F
: