Target
Alpha-1-antitrypsin-related protein
Ligand
BDBM50577299
Substrate
Meas. Tech.
ChEMBL_2129942 (CHEMBL4839371)
IC50
641±n/a nM
Citation
 Berger, MWortmann, LBuchgraber, PLücking, UZitzmann-Kolbe, SWengner, AMBader, BBömer, UBriem, HEis, KRehwinkel, HBartels, FMoosmayer, DEberspächer, ULienau, PHammer, SSchatz, CAWang, QWang, QMumberg, DNising, CFSiemeister, G BAY-8400: A Novel Potent and Selective DNA-PK Inhibitor which Shows Synergistic Efficacy in Combination with Targeted Alpha Therapies. J Med Chem 64:12723-12737 (2021)  
Target
Name:
Alpha-1-antitrypsin-related protein
Synonyms:
A1ATR_HUMAN ATR Protease inhibitor 1-like SERPINA2 Serpin A2
Type:
PROTEIN
Mol. Mass.:
47899.52
Organism:
Homo sapiens
Description:
ChEMBL_120395
Residue:
420
  
Inhibitor
Name:
BDBM50577299
Synonyms:
CHEMBL4875626
Type:
Small organic molecule
Emp. Form.:
C21H17F2N5
Mol. Mass.:
377.39
SMILES:
FC(F)c1cncc(c1)-c1ccc2ncc3nnc(C4=CCCCC4)n3c2c1
: