Target
Arginase-1
Ligand
BDBM50577469
Substrate
Meas. Tech.
ChEMBL_2130269 (CHEMBL4839698)
IC50
2.0±n/a nM
Citation
 Lu, MZhang, HLi, DChilders, MPu, QPalte, RLGathiaka, SLyons, TWPalani, AFan, PWSpacciapoli, PMiller, JRCho, HCheng, MChakravarthy, KO'Neil, JEangoor, PBeard, AKim, HYSaurí, JGunaydin, HSloman, DLSiliphaivanh, PCumming, JFischer, C Structure-Based Discovery of Proline-Derived Arginase Inhibitors with Improved Oral Bioavailability for Immuno-Oncology. ACS Med Chem Lett 12:1380-1388 (2021)  
Target
Name:
Arginase-1
Synonyms:
ARG1 Liver-type arginase | Type I arginase
Type:
PROTEIN
Mol. Mass.:
34737.53
Organism:
Homo sapiens (Human)
Description:
ChEMBL_978893
Residue:
322
  
Inhibitor
Name:
BDBM50577469
Synonyms:
CHEMBL4850213
Type:
Small organic molecule
Emp. Form.:
C13H26BN3O5
Mol. Mass.:
315.174
SMILES:
CC(C)[C@H](N)C(=O)N[C@H]1CN[C@@H]([C@@H]1CCCB(O)O)C(O)=O
: