Target
Potassium voltage-gated channel subfamily H member 2
Ligand
BDBM50578114
Substrate
Meas. Tech.
ChEMBL_2132048 (CHEMBL4841563)
IC50
1900±n/a nM
Citation
 Ishida, AOkabe, YMatsushita, TSekiguchi, TNishio, TKomagata, TIwaki, MMiyata, HKatagi, JNaganawa, AMaruyama, TImagawa, A Design, synthesis, and biological evaluation of novel somatostatin receptor subtype-2 agonists: Optimization for potency and risk mitigation of hERG and phospholipidosis. Bioorg Med Chem 49:0 (2021)  
Target
Name:
Potassium voltage-gated channel subfamily H member 2
Synonyms:
1,3-beta-glucan synthase component GLS2 ERG Eag-related protein 1 Ether-a-go-go-related gene (HERG) Ether-a-go-go-related gene potassium channel 1 Ether-a-go-go-related gene potassium channel 1 (hERG1) Ether-a-go-go-related protein 1 H-ERG KCNH2 Potassium voltage-gated channel subfamily H member 2 (hERG) Voltage-gated potassium channel subunit Kv11.1 hERG Potassium Channel 1 | putative potassium channel subunit
Type:
Multi-pass membrane protein
Mol. Mass.:
126672.65
Organism:
Homo sapiens (Human)
Description:
Q12809
Residue:
1159
  
Inhibitor
Name:
BDBM50578114
Synonyms:
CHEMBL4862717
Type:
Small organic molecule
Emp. Form.:
C24H22Cl2N6O
Mol. Mass.:
481.377
SMILES:
NC1CCN(CC1)c1c(NC(=O)c2cn3ccccc3n2)cncc1-c1cc(Cl)cc(Cl)c1
: