Target
Serine/threonine-protein kinase TNNI3K
Ligand
BDBM50578225
Substrate
Meas. Tech.
ChEMBL_2132296 (CHEMBL4841811)
Ki
0.540000±n/a nM
Citation
 Patterson, JRGraves, APStoy, PCheung, MDesai, TAFries, HGatto, GJHolt, DAShewchuk, LTotoritis, RWang, LKallander, LS Identification of Diarylurea Inhibitors of the Cardiac-Specific Kinase TNNI3K by Designing Selectivity Against VEGFR2, p38?, and B-Raf. J Med Chem 64:15651-15670 (2021)  
Target
Name:
Serine/threonine-protein kinase TNNI3K
Synonyms:
CARK TNI3K_HUMAN | TNNI3K
Type:
Enzyme Catalytic Domain
Mol. Mass.:
92855.14
Organism:
Homo sapiens (Human)
Description:
gi_7705748
Residue:
835
  
Inhibitor
Name:
BDBM50578225
Synonyms:
CHEMBL4869303
Type:
Small organic molecule
Emp. Form.:
C19H14Cl2F3N5O2
Mol. Mass.:
472.248
SMILES:
CNc1cc(Oc2c(Cl)cc(NC(=O)Nc3cccc(c3)C(F)(F)F)cc2Cl)ncn1
: