Target
5-hydroxytryptamine receptor 2C
Ligand
BDBM50443101
Substrate
Meas. Tech.
ChEMBL_2132586 (CHEMBL4842101)
Ki
198±n/a nM
Citation
 Yan, WFan, LYu, JLiu, RWang, HTan, LWang, SCheng, J 2-Phenylcyclopropylmethylamine Derivatives as Dopamine D J Med Chem 64:17239-17258 (2021)  
Target
Name:
5-hydroxytryptamine receptor 2C
Synonyms:
5-HT-1C 5-HT1C 5-HTR2C 5HT2C_HUMAN HTR2C | Serotonin receptor 2C
Type:
PROTEIN
Mol. Mass.:
51820.72
Organism:
Homo sapiens
Description:
ChEMBL_104992
Residue:
458
  
Inhibitor
Name:
BDBM50443101
Synonyms:
Cariprazine | RGH-188
Type:
Small organic molecule
Emp. Form.:
C21H32Cl2N4O
Mol. Mass.:
427.411
SMILES:
CN(C)C(=O)N[C@H]1CC[C@H](CCN2CCN(CC2)c2cccc(Cl)c2Cl)CC1
: