Target
5-hydroxytryptamine receptor 2C
Ligand
BDBM50578335
Substrate
Meas. Tech.
ChEMBL_2132586 (CHEMBL4842101)
Ki
305±n/a nM
Citation
 Yan, WFan, LYu, JLiu, RWang, HTan, LWang, SCheng, J 2-Phenylcyclopropylmethylamine Derivatives as Dopamine D J Med Chem 64:17239-17258 (2021)  
Target
Name:
5-hydroxytryptamine receptor 2C
Synonyms:
5-HT-1C 5-HT1C 5-HTR2C 5HT2C_HUMAN HTR2C | Serotonin receptor 2C
Type:
PROTEIN
Mol. Mass.:
51820.72
Organism:
Homo sapiens
Description:
ChEMBL_104992
Residue:
458
  
Inhibitor
Name:
BDBM50578335
Synonyms:
CHEMBL4863832
Type:
Small organic molecule
Emp. Form.:
C23H25FN2O3
Mol. Mass.:
396.4546
SMILES:
COc1ccc(F)cc1[C@H]1C[C@@H]1CNCCCOc1ccc2ccc(=O)[nH]c2c1
: