Target
Mitogen-activated protein kinase 8
Ligand
BDBM50578345
Substrate
Meas. Tech.
ChEMBL_2132756 (CHEMBL4842271)
IC50
2390±n/a nM
Citation
 Nagy, MAHilgraf, RMortensen, DSElsner, JNorris, STikhe, JYoon, WPaisner, DDelgado, MErdman, PHaelewyn, JKhambatta, GXu, LRomanow, WJCondroski, KBahmanyar, SMcCarrick, MBenish, BBlease, KLeBrun, LMoghaddam, MFApuy, JCanan, SSBennett, BLSatoh, Y Discovery of the c-Jun N-Terminal Kinase Inhibitor  J Med Chem 64:18193-18208 (2021)  
Target
Name:
Mitogen-activated protein kinase 8
Synonyms:
Jnk1 MAPK 8 Mapk8 Stress-activated protein kinase JNK1 | c-Jun N-terminal kinase 1
Type:
PROTEIN
Mol. Mass.:
44234.80
Organism:
Mus musculus
Description:
ChEMBL_120521
Residue:
384
  
Inhibitor
Name:
BDBM50578345
Synonyms:
CHEMBL4848290
Type:
Small organic molecule
Emp. Form.:
C15H25N5O2
Mol. Mass.:
307.3913
SMILES:
CO[C@H]1CC[C@@H](CC1)Nc1ncc(C(N)=O)c(NC(C)C)n1
: