Target
Proteinase-activated receptor 4
Ligand
BDBM50578821
Substrate
Meas. Tech.
ChEMBL_2134237 (CHEMBL4843847)
IC50
1630±n/a nM
Citation
 Liu, SYuan, DLi, SXie, RKong, YZhu, X Synthesis and evaluation of novel and potent protease activated receptor 4 (PAR4) antagonists based on a quinazolin-4(3H)-one scaffold. Eur J Med Chem 225:0 (2021)  
Target
Name:
Proteinase-activated receptor 4
Synonyms:
Coagulation factor II receptor-like 3 PAR-4 Par4 Thrombin receptor-like 3
Type:
PROTEIN
Mol. Mass.:
42798.57
Organism:
Mus musculus
Description:
ChEMBL_120384
Residue:
396
  
Inhibitor
Name:
BDBM50578821
Synonyms:
CHEMBL4871870
Type:
Small organic molecule
Emp. Form.:
C18H16ClN3O2S
Mol. Mass.:
373.857
SMILES:
COCc1nc2cc(C)cc(-c3nc4c(Cl)cc(OC)cc4s3)c2[nH]1
: