Target
Retinoic acid receptor RXR-alpha
Ligand
BDBM50129725
Substrate
Meas. Tech.
ChEMBL_196620 (CHEMBL800656)
EC50
4±n/a nM
Citation
 Gernert, DLNeel, DABoehm, MFLeibowitz, MDMais, DAMichellys, PYRungta, DReifel-Miller, AGrese, TA Design and synthesis of benzofused heterocyclic RXR modulators. Bioorg Med Chem Lett 14:2759-63 (2004)  
Target
Name:
Retinoic acid receptor RXR-alpha
Synonyms:
NR2B1 Nuclear receptor subfamily 4 group A member 2 RXRA Retinoic acid receptor RXR-alpha/gamma Retinoid receptor
Type:
PROTEIN
Mol. Mass.:
50820.38
Organism:
Homo sapiens (Human)
Description:
ChEMBL_1456363
Residue:
462
  
Inhibitor
Name:
BDBM50129725
Synonyms:
(2E,4E,6Z)-7-(2-Butoxy-3,5-diisopropyl-phenyl)-3-methyl-octa-2,4,6-trienoic acid CHEMBL414218
Type:
Small organic molecule
Emp. Form.:
C25H36O3
Mol. Mass.:
384.5515
SMILES:
CCCCOc1c(cc(cc1\C(C)=C/C=C/C(/C)=C/C(O)=O)C(C)C)C(C)C
: