Target
Retinoic acid receptor RXR-alpha
Ligand
BDBM50146337
Substrate
Meas. Tech.
ChEMBL_196624 (CHEMBL800659)
Ki
3.2±n/a nM
Citation
 Gernert, DLNeel, DABoehm, MFLeibowitz, MDMais, DAMichellys, PYRungta, DReifel-Miller, AGrese, TA Design and synthesis of benzofused heterocyclic RXR modulators. Bioorg Med Chem Lett 14:2759-63 (2004)  
Target
Name:
Retinoic acid receptor RXR-alpha
Synonyms:
NR2B1 Nuclear receptor subfamily 4 group A member 2 RXRA Retinoic acid receptor RXR-alpha/gamma Retinoid receptor
Type:
PROTEIN
Mol. Mass.:
50820.38
Organism:
Homo sapiens (Human)
Description:
ChEMBL_1456363
Residue:
462
  
Inhibitor
Name:
BDBM50146337
Synonyms:
(E)-3-[3-(2-Butoxy-3,5-di-tert-butyl-phenyl)-1H-indol-5-yl]-but-2-enoic acid | CHEMBL93246
Type:
Small organic molecule
Emp. Form.:
C30H39NO3
Mol. Mass.:
461.6356
SMILES:
CCCCOc1c(cc(cc1C(C)(C)C)C(C)(C)C)-c1c[nH]c2ccc(cc12)C(\C)=C\C(O)=O
: