Target
5-hydroxytryptamine receptor 6
Ligand
BDBM50579335
Substrate
Meas. Tech.
ChEMBL_2134899 (CHEMBL4844509)
Ki
1.7±n/a nM
Citation
 Wichur, TPasieka, AGody?, JPanek, DGóral, ILatacz, GHonkisz-Orzechowska, EBucki, ASiwek, AG?uch-Lutwin, MKnez, DBrazzolotto, XGobec, SKo?aczkowski, MSabate, RMalawska, BWi?ckowska, A Discovery of 1-(phenylsulfonyl)-1H-indole-based multifunctional ligands targeting cholinesterases and 5-HT Eur J Med Chem 225:0 (2021)  
Target
Name:
5-hydroxytryptamine receptor 6
Synonyms:
5-HT-6 5-hydroxytryptamine receptor 6 (5-HT-6) 5-hydroxytryptamine receptor 6 (5HT6) HTR6 Serotonin 6 (5-HT6) receptor | Serotonin Receptor 6
Type:
G Protein-Coupled Receptor (GPCR)
Mol. Mass.:
46968.43
Organism:
Homo sapiens (Human)
Description:
P50406
Residue:
440
  
Inhibitor
Name:
BDBM50579335
Synonyms:
CHEMBL4854972
Type:
Small organic molecule
Emp. Form.:
C26H26F3N3O3S
Mol. Mass.:
517.563
SMILES:
FC(F)(F)c1cccc(CNCCNCCOc2cccc3n(ccc23)S(=O)(=O)c2ccccc2)c1
: