Target
Acetylcholinesterase
Ligand
BDBM50579320
Substrate
Meas. Tech.
ChEMBL_2134902 (CHEMBL4844512)
IC50
58±n/a nM
Citation
 Wichur, TPasieka, AGody?, JPanek, DGóral, ILatacz, GHonkisz-Orzechowska, EBucki, ASiwek, AG?uch-Lutwin, MKnez, DBrazzolotto, XGobec, SKo?aczkowski, MSabate, RMalawska, BWi?ckowska, A Discovery of 1-(phenylsulfonyl)-1H-indole-based multifunctional ligands targeting cholinesterases and 5-HT Eur J Med Chem 225:0 (2021)  
Target
Name:
Acetylcholinesterase
Synonyms:
ACES_ELEEL Acetylcholinesterase (EeAChE) | ache
Type:
Enzyme
Mol. Mass.:
71812.79
Organism:
Electrophorus electricus (Electric eel)
Description:
Residue:
633
  
Inhibitor
Name:
BDBM50579320
Synonyms:
CHEMBL4874513
Type:
Small organic molecule
Emp. Form.:
C33H36N4O3S
Mol. Mass.:
568.729
SMILES:
O=S(=O)(c1ccccc1)n1ccc2c(OCCNCCCCNc3c4CCCCc4nc4ccccc34)cccc12
: