Target
5-hydroxytryptamine receptor 3A
Ligand
BDBM50417287
Substrate
Meas. Tech.
ChEMBL_2134928 (CHEMBL4844538)
IC50
1.7±n/a nM
Citation
 Zajdel, PGrychowska, KMogilski, SKurczab, RSata?a, GBugno, RKos, TGo??biowska, JMalikowska-Racia, NNikiforuk, AChaumont-Dubel, SBantreil, XPaw?owski, MMartinez, JSubra, GLamaty, FMarin, PBojarski, AJPopik, P Structure-Based Design and Optimization of FPPQ, a Dual-Acting 5-HT J Med Chem 64:13279-13298 (2021)  
Target
Name:
5-hydroxytryptamine receptor 3A
Synonyms:
5-HT-3 5-HT3A 5-hydroxytryptamine receptor 3 (5-HT3) 5-hydroxytryptamine receptor 3A (5HT3A) 5HT3R HTR3A Serotonin 3 receptor (5HT3) Serotonin-gated ion channel receptor | Serotonin-gated ion channel receptor 3
Type:
Protein
Mol. Mass.:
55283.27
Organism:
Homo sapiens (Human)
Description:
P46098
Residue:
478
  
Inhibitor
Name:
BDBM50417287
Synonyms:
Aloxi PALONOSETRON | PALONOSETRON HYDROCHLORIDE
Type:
Small organic molecule
Emp. Form.:
C19H24N2O
Mol. Mass.:
296.4067
SMILES:
O=C1N(C[C@H]2CCCc3cccc1c23)[C@@H]1CN2CCC1CC2
: