Target
Hepatitis A virus cellular receptor 2
Ligand
BDBM50579434
Substrate
Meas. Tech.
ChEMBL_2135390 (CHEMBL4845000)
Kd
40000±n/a nM
Citation
 Rietz, TATeuscher, KBMills, JJGogliotti, RDLepovitz, LTScaggs, WRYoshida, KLuong, KLee, TFesik, SW Fragment-Based Discovery of Small Molecules Bound to T-Cell Immunoglobulin and Mucin Domain-Containing Molecule 3 (TIM-3). J Med Chem 64:14757-14772 (2021)  
Target
Name:
Hepatitis A virus cellular receptor 2
Synonyms:
CD_antigen=CD366 HAVR2_HUMAN Hepatitis A virus cellular receptor 2 T-cell immunoglobulin mucin receptor 3 TIM-3 TIMD-3 | TIMD3
Type:
PROTEIN
Mol. Mass.:
33391.41
Organism:
Homo sapiens
Description:
ChEMBL_119972
Residue:
301
  
Inhibitor
Name:
BDBM50579434
Synonyms:
CHEMBL4854696
Type:
Small organic molecule
Emp. Form.:
C12H10BrClN4O
Mol. Mass.:
341.591
SMILES:
CC(C)c1nc2c3cc(Br)c(Cl)cc3[nH]c(=O)n2n1
: