Target
Hepatitis A virus cellular receptor 2
Ligand
BDBM50579450
Substrate
Meas. Tech.
ChEMBL_2135392 (CHEMBL4845002)
Ki
2300±n/a nM
Citation
 Rietz, TATeuscher, KBMills, JJGogliotti, RDLepovitz, LTScaggs, WRYoshida, KLuong, KLee, TFesik, SW Fragment-Based Discovery of Small Molecules Bound to T-Cell Immunoglobulin and Mucin Domain-Containing Molecule 3 (TIM-3). J Med Chem 64:14757-14772 (2021)  
Target
Name:
Hepatitis A virus cellular receptor 2
Synonyms:
CD_antigen=CD366 HAVR2_HUMAN Hepatitis A virus cellular receptor 2 T-cell immunoglobulin mucin receptor 3 TIM-3 TIMD-3 | TIMD3
Type:
PROTEIN
Mol. Mass.:
33391.41
Organism:
Homo sapiens
Description:
ChEMBL_119972
Residue:
301
  
Inhibitor
Name:
BDBM50579450
Synonyms:
CHEMBL4876721
Type:
Small organic molecule
Emp. Form.:
C18H13ClN6O
Mol. Mass.:
364.788
SMILES:
Cc1nc2c3cc(c(Cl)cc3[nH]c(=O)n2n1)-c1c(C)ccc2[nH]ncc12
: