Target
Hepatitis A virus cellular receptor 2
Ligand
BDBM50579454
Substrate
Meas. Tech.
ChEMBL_2135392 (CHEMBL4845002)
Ki
970±n/a nM
Citation
 Rietz, TATeuscher, KBMills, JJGogliotti, RDLepovitz, LTScaggs, WRYoshida, KLuong, KLee, TFesik, SW Fragment-Based Discovery of Small Molecules Bound to T-Cell Immunoglobulin and Mucin Domain-Containing Molecule 3 (TIM-3). J Med Chem 64:14757-14772 (2021)  
Target
Name:
Hepatitis A virus cellular receptor 2
Synonyms:
CD_antigen=CD366 HAVR2_HUMAN Hepatitis A virus cellular receptor 2 T-cell immunoglobulin mucin receptor 3 TIM-3 TIMD-3 | TIMD3
Type:
PROTEIN
Mol. Mass.:
33391.41
Organism:
Homo sapiens
Description:
ChEMBL_119972
Residue:
301
  
Inhibitor
Name:
BDBM50579454
Synonyms:
CHEMBL4868118
Type:
Small organic molecule
Emp. Form.:
C18H16ClN5O4S
Mol. Mass.:
433.869
SMILES:
COc1cc(ccc1NS(C)(=O)=O)-c1cc2c3nc(C)nn3c(=O)[nH]c2cc1Cl
: