Target
Dual specificity calcium/calmodulin-dependent 3',5'-cyclic nucleotide phosphodiesterase 1A/1B
Ligand
BDBM14390
Substrate
Meas. Tech.
ChEMBL_156014 (CHEMBL764106)
IC50
>10000±n/a nM
Citation
 Pitts, WJVaccaro, WHuynh, TLeftheris, KRoberge, JYBarbosa, JGuo, JBrown, BWatson, ADonaldson, KStarling, GCKiener, PAPoss, MADodd, JHBarrish, JC Identification of purine inhibitors of phosphodiesterase 7 (PDE7). Bioorg Med Chem Lett 14:2955-8 (2004)  
Target
Name:
Dual specificity calcium/calmodulin-dependent 3',5'-cyclic nucleotide phosphodiesterase 1A/1B
Synonyms:
Phosphodiesterase 1
Type:
Mol. Mass.:
Description:
ASSAY_ID of ChEMBL is 156011
Components:
This complex has 2 components.
Component 1
Name:
Dual specificity calcium/calmodulin-dependent 3',5'-cyclic nucleotide phosphodiesterase 1B
Synonyms:
63 kDa Cam-PDE Cam-PDE 1B PDE1B1 | PDE1B_BOVIN
Type:
PROTEIN
Mol. Mass.:
60991.90
Organism:
Bos taurus
Description:
ChEMBL_104913
Residue:
534
  
Component 2
Name:
Dual specificity calcium/calmodulin-dependent 3',5'-cyclic nucleotide phosphodiesterase 1A
Synonyms:
Calcium/calmodulin-dependent 3',5'-cyclic nucleotide phosphodiesterase 1A PDE1A Phosphodiesterase 1 | Phosphodiesterase 1A
Type:
Enzyme Catalytic Domain
Mol. Mass.:
60835.05
Organism:
BOVINE
Description:
Phosphodiesterase 1 0 BOVINE::P14100
Residue:
530
  
Inhibitor
Name:
BDBM14390
Synonyms:
5-[2-ethoxy-5-(4-methyl-1-piperazinylsulfonyl)phenyl]-1-methyl-3-n-propyl-1,6-dihydro-7H-pyrazolo[4,3-d]pyrimidin-7-one CHEMBL192 Sildenafil US11155558, Compound sildenafil Viagra
Type:
Small organic molecule
Emp. Form.:
C22H30N6O4S
Mol. Mass.:
474.576
SMILES:
CCCc1nn(C)c2c1nc([nH]c2=O)-c1cc(ccc1OCC)S(=O)(=O)N1CCN(C)CC1
: