Target
Alpha-1,6-mannosyl-glycoprotein 2-beta-N-acetylglucosaminyltransferase
Ligand
BDBM50579526
Substrate
Meas. Tech.
ChEMBL_2135439 (CHEMBL4845049)
IC50
12±n/a nM
Citation
 Turdi, HChao, HHangeland, JJAhmad, SMeng, WBrigance, RZhao, GWang, WMoore, FYe, XYMathur, AHou, XKempson, JWu, DRLi, YXAzzara, AVMa, ZChu, CHChen, LCullen, MJRooney, SHarvey, SKopcho, LPanemangelor, RAbell, LO'Malley, KKeim, WJDierks, EChang, SFoster, KApedo, AHarden, DDabros, MGao, QPelleymounter, MAWhaley, JMRobl, JACheng, DLawrence, RMDevasthale, P Screening Hit to Clinical Candidate: Discovery of BMS-963272, a Potent, Selective MGAT2 Inhibitor for the Treatment of Metabolic Disorders. J Med Chem 64:14773-14792 (2021)  
Target
Name:
Alpha-1,6-mannosyl-glycoprotein 2-beta-N-acetylglucosaminyltransferase
Synonyms:
Beta-1,2-N-acetylglucosaminyltransferase II GlcNAc-T II Mannoside acetylglucosaminyltransferase 2 N-glycosyl-oligosaccharide-glycoprotein N-acetylglucosaminyltransferase II
Type:
PROTEIN
Mol. Mass.:
51045.37
Organism:
Mus musculus
Description:
ChEMBL_107583
Residue:
442
  
Inhibitor
Name:
BDBM50579526
Synonyms:
CHEMBL4878564
Type:
Small organic molecule
Emp. Form.:
C26H25F6N5O2
Mol. Mass.:
553.4994
SMILES:
Cc1ccc(cc1)C1=C(c2nnn[nH]2)C(=O)N[C@@](C1)(c1ccc(OCCCCCC(F)(F)F)cc1)C(F)(F)F
: