Target
Endothelin-1 receptor
Ligand
BDBM50146655
Substrate
Meas. Tech.
ChEMBL_65482 (CHEMBL682357)
IC50
6.7±n/a nM
Citation
 Bolli, MHMarfurt, JGrisostomi, CBoss, CBinkert, CHess, PTreiber, AThorin, EMorrison, KBuchmann, SBur, DRamuz, HClozel, MFischli, WWeller, T Novel benzo[1,4]diazepin-2-one derivatives as endothelin receptor antagonists. J Med Chem 47:2776-95 (2004)  
Target
Name:
Endothelin-1 receptor
Synonyms:
EDNRA ET-A ETA-R Endothelin receptor type A hET-AR
Type:
Enzyme Catalytic Domain
Mol. Mass.:
48736.88
Organism:
Homo sapiens (Human)
Description:
P25101
Residue:
427
  
Inhibitor
Name:
BDBM50146655
Synonyms:
(S)-(4,6-Dimethyl-pyrimidin-2-yloxy)-[(S)-1-(3-fluoro-benzyl)-2-oxo-5-phenyl-2,3,4,5-tetrahydro-1H-benzo[e][1,4]diazepin-5-yl]-acetic acid | CHEMBL96746
Type:
Small organic molecule
Emp. Form.:
C30H27FN4O4
Mol. Mass.:
526.5582
SMILES:
Cc1cc(C)nc(O[C@H](C(O)=O)[C@]2(NCC(=O)N(Cc3cccc(F)c3)c3ccccc23)c2ccccc2)n1
: