Target
Endothelin-1 receptor
Ligand
BDBM50146709
Substrate
Meas. Tech.
ChEMBL_65482 (CHEMBL682357)
IC50
7.5±n/a nM
Citation
 Bolli, MHMarfurt, JGrisostomi, CBoss, CBinkert, CHess, PTreiber, AThorin, EMorrison, KBuchmann, SBur, DRamuz, HClozel, MFischli, WWeller, T Novel benzo[1,4]diazepin-2-one derivatives as endothelin receptor antagonists. J Med Chem 47:2776-95 (2004)  
Target
Name:
Endothelin-1 receptor
Synonyms:
EDNRA ET-A ETA-R Endothelin receptor type A hET-AR
Type:
Enzyme Catalytic Domain
Mol. Mass.:
48736.88
Organism:
Homo sapiens (Human)
Description:
P25101
Residue:
427
  
Inhibitor
Name:
BDBM50146709
Synonyms:
(S)-(4,6-Dimethyl-pyrimidin-2-yloxy)-[(S)-1-(2-methoxy-ethoxymethyl)-2-oxo-5-phenyl-2,3,4,5-tetrahydro-1H-benzo[e][1,4]diazepin-5-yl]-acetic acid | CHEMBL433173
Type:
Small organic molecule
Emp. Form.:
C27H30N4O6
Mol. Mass.:
506.5503
SMILES:
COCCOCN1c2ccccc2[C@](NCC1=O)([C@H](Oc1nc(C)cc(C)n1)C(O)=O)c1ccccc1
: