Target
Tissue-type plasminogen activator
Ligand
BDBM50138663
Substrate
Meas. Tech.
ChEBML_208233
Ki
>100000±n/a nM
Citation
 Wendt, MDGeyer, AMcClellan, WJRockway, TWWeitzberg, MZhao, XMantei, RStewart, KNienaber, VKlinghofer, VGiranda, VL Interaction with the S1 beta-pocket of urokinase: 8-heterocycle substituted and 6,8-disubstituted 2-naphthamidine urokinase inhibitors. Bioorg Med Chem Lett 14:3063-8 (2004)  
Target
Name:
Tissue-type plasminogen activator
Synonyms:
Alteplase Reteplase Thrombin receptor protein Tissue-type plasminogen activator (tPA) t-PA t-plasminogen activator
Type:
Enzyme
Mol. Mass.:
62931.08
Organism:
Homo sapiens (Human)
Description:
Residue:
562
  
Inhibitor
Name:
BDBM50138663
Synonyms:
2-naphthimidamide Naphthalene-2-carboxamidine uPa_6
Type:
Small organic molecule
Emp. Form.:
C11H10N2
Mol. Mass.:
170.2105
SMILES:
NC(=N)c1ccc2ccccc2c1
: