Target
Bromodomain testis-specific protein
Ligand
BDBM50435735
Substrate
Meas. Tech.
ChEMBL_2145709 (CHEMBL5029989)
Kd
1800±n/a nM
Citation
 Karim, RMBikowitz, MJChan, AZhu, JYGrassie, DBecker, ABerndt, NGunawan, SLawrence, NJSchönbrunn, E Differential BET Bromodomain Inhibition by Dihydropteridinone and Pyrimidodiazepinone Kinase Inhibitors. J Med Chem 64:15772-15786 (2021)  
Target
Name:
Bromodomain testis-specific protein
Synonyms:
BRDT Bromodomain and extra-terminal motif (BET) Cancer/testis antigen 9 | RING3-like protein
Type:
PROTEIN
Mol. Mass.:
107982.01
Organism:
Homo sapiens (Human)
Description:
ChEMBL_1502985
Residue:
947
  
Inhibitor
Name:
BDBM50435735
Synonyms:
CHEMBL2392553
Type:
Small organic molecule
Emp. Form.:
C27H35F2N7O3
Mol. Mass.:
543.6087
SMILES:
COc1cc(ccc1Nc1ncc2N(C)C(=O)C(F)(F)CN(C3CCCC3)c2n1)C(=O)NC1CCN(C)CC1
: