Target
Sulfide:quinone oxidoreductase, mitochondrial
Ligand
BDBM50579922
Substrate
Meas. Tech.
ChEMBL_2145890 (CHEMBL5030170)
IC50
1360±n/a nM
Citation
 Baugh, SDPJackson, MRRashad, AAReitz, ABLam, PYSJorns, MS Synthesis and evaluation of potent novel inhibitors of human sulfide:quinone oxidoreductase. Bioorg Med Chem Lett 54:0 (2021)  
Target
Name:
Sulfide:quinone oxidoreductase, mitochondrial
Synonyms:
1.8.5.8 SQOR_HUMAN | SQRDL
Type:
PROTEIN
Mol. Mass.:
49975.74
Organism:
Homo sapiens
Description:
ChEMBL_119262
Residue:
450
  
Inhibitor
Name:
BDBM50579922
Synonyms:
CHEMBL5075924
Type:
Small organic molecule
Emp. Form.:
C20H15FN2O2
Mol. Mass.:
334.3437
SMILES:
COc1ccc(cc1)-c1cc(-c2ccc(F)cc2)c(C#N)c(OC)n1
: