Target
Sulfide:quinone oxidoreductase, mitochondrial
Ligand
BDBM50579929
Substrate
Meas. Tech.
ChEMBL_2145890 (CHEMBL5030170)
IC50
123±n/a nM
Citation
 Baugh, SDPJackson, MRRashad, AAReitz, ABLam, PYSJorns, MS Synthesis and evaluation of potent novel inhibitors of human sulfide:quinone oxidoreductase. Bioorg Med Chem Lett 54:0 (2021)  
Target
Name:
Sulfide:quinone oxidoreductase, mitochondrial
Synonyms:
1.8.5.8 SQOR_HUMAN | SQRDL
Type:
PROTEIN
Mol. Mass.:
49975.74
Organism:
Homo sapiens
Description:
ChEMBL_119262
Residue:
450
  
Inhibitor
Name:
BDBM50579929
Synonyms:
CHEMBL5084456
Type:
Small organic molecule
Emp. Form.:
C21H17FN2O2
Mol. Mass.:
348.3703
SMILES:
COCCOc1nc(cc(-c2ccc(F)cc2)c1C#N)-c1ccccc1
: