Target
Sulfide:quinone oxidoreductase, mitochondrial
Ligand
BDBM50579930
Substrate
Meas. Tech.
ChEMBL_2145890 (CHEMBL5030170)
IC50
100±n/a nM
Citation
 Baugh, SDPJackson, MRRashad, AAReitz, ABLam, PYSJorns, MS Synthesis and evaluation of potent novel inhibitors of human sulfide:quinone oxidoreductase. Bioorg Med Chem Lett 54:0 (2021)  
Target
Name:
Sulfide:quinone oxidoreductase, mitochondrial
Synonyms:
1.8.5.8 SQOR_HUMAN | SQRDL
Type:
PROTEIN
Mol. Mass.:
49975.74
Organism:
Homo sapiens
Description:
ChEMBL_119262
Residue:
450
  
Inhibitor
Name:
BDBM50579930
Synonyms:
CHEMBL5080718
Type:
Small organic molecule
Emp. Form.:
C25H18N2O
Mol. Mass.:
362.4232
SMILES:
N#Cc1c(OCc2ccccc2)nc(cc1-c1ccccc1)-c1ccccc1
: