Target
Histone-arginine methyltransferase CARM1
Ligand
BDBM50194756
Substrate
Meas. Tech.
ChEMBL_2146493 (CHEMBL5030839)
IC50
34±n/a nM
Citation
 Shen, YLi, FSzewczyk, MMHalabelian, LChau, IEram, MSDela Seña, CPark, KSMeng, FChen, HZeng, HDong, AWu, HTrush, VVMcLeod, DZepeda-Velázquez, CACampbell, RMMader, MMWatson, BMSchapira, MArrowsmith, CHAl-Awar, RBarsyte-Lovejoy, DKaniskan, HÜBrown, PJVedadi, MJin, J A First-in-Class, Highly Selective and Cell-Active Allosteric Inhibitor of Protein Arginine Methyltransferase 6. J Med Chem 64:3697-3706 (2021)  
Target
Name:
Histone-arginine methyltransferase CARM1
Synonyms:
CARM1 Coactivator-associated arginine methyltransferase 1 PRMT4 Protein arginine methyltransferase 4 (PRMT4)
Type:
Protein
Mol. Mass.:
65855.47
Organism:
Homo sapiens (Human)
Description:
Q86X55
Residue:
608
  
Inhibitor
Name:
BDBM50194756
Synonyms:
CHEMBL3961701
Type:
Small organic molecule
Emp. Form.:
C15H24N2O
Mol. Mass.:
248.3639
SMILES:
CNCCN1CCC(CC1)OCc1ccccc1
: