Target
Sphingosine 1-phosphate receptor 1
Ligand
BDBM50147703
Substrate
Meas. Tech.
ChEMBL_201317 (CHEMBL806167)
IC50
0.100000±n/a nM
Citation
 Hale, JJNeway, WMills, SGHajdu, RAnn Keohane, CRosenbach, MMilligan, JShei, GJChrebet, GBergstrom, JCard, DKoo, GCKoprak, SLJackson, JJRosen, HMandala, S Potent S1P receptor agonists replicate the pharmacologic actions of the novel immune modulator FTY720. Bioorg Med Chem Lett 14:3351-5 (2004)  
Target
Name:
Sphingosine 1-phosphate receptor 1
Synonyms:
CHEDG1 Endothelial differentiation G-protein coupled receptor 1 S1P1 S1PR1_HUMAN Sphingosine 1-phosphate receptor Edg-1
Type:
Enzyme
Mol. Mass.:
42836.02
Organism:
Homo sapiens (Human)
Description:
P21453
Residue:
382
  
Inhibitor
Name:
BDBM50147703
Synonyms:
CHEMBL115554 [(1S,3R)-3-Amino-1-hydroxy-5-(4-octyl-phenyl)-pentyl]-phosphonic acid
Type:
Small organic molecule
Emp. Form.:
C19H34NO4P
Mol. Mass.:
371.4513
SMILES:
CCCCCCCCc1ccc(CC[C@@H](N)CC(=O)P(O)(O)O)cc1
: