Target
Sphingosine 1-phosphate receptor 2
Ligand
BDBM50147704
Substrate
Meas. Tech.
ChEMBL_201454 (CHEMBL807599)
IC50
240±n/a nM
Citation
 Hale, JJNeway, WMills, SGHajdu, RAnn Keohane, CRosenbach, MMilligan, JShei, GJChrebet, GBergstrom, JCard, DKoo, GCKoprak, SLJackson, JJRosen, HMandala, S Potent S1P receptor agonists replicate the pharmacologic actions of the novel immune modulator FTY720. Bioorg Med Chem Lett 14:3351-5 (2004)  
Target
Name:
Sphingosine 1-phosphate receptor 2
Synonyms:
EDG5 S1PR2 Sphingosine 1-phosphate receptor Sphingosine-1-phosphate receptor 2 | ndothelial differentiation G-protein coupled receptor 5
Type:
G Protein-Coupled Receptor (GPCR)
Mol. Mass.:
38883.16
Organism:
Homo sapiens (Human)
Description:
Membranes isolated from S1P2-transfected CHO cells were used in ligand binding assay.
Residue:
353
  
Inhibitor
Name:
BDBM50147704
Synonyms:
CHEMBL112655 [3-Amino-2-hydroxy-5-(4-octyl-phenyl)-pentyl]-phosphonic acid
Type:
Small organic molecule
Emp. Form.:
C19H34NO4P
Mol. Mass.:
371.4513
SMILES:
CCCCCCCCc1ccc(CCC(N)C(=O)CP(O)(O)O)cc1
: