Target
Sphingosine 1-phosphate receptor 3
Ligand
BDBM50147706
Substrate
Meas. Tech.
ChEMBL_201334 (CHEMBL806183)
IC50
510±n/a nM
Citation
 Hale, JJNeway, WMills, SGHajdu, RAnn Keohane, CRosenbach, MMilligan, JShei, GJChrebet, GBergstrom, JCard, DKoo, GCKoprak, SLJackson, JJRosen, HMandala, S Potent S1P receptor agonists replicate the pharmacologic actions of the novel immune modulator FTY720. Bioorg Med Chem Lett 14:3351-5 (2004)  
Target
Name:
Sphingosine 1-phosphate receptor 3
Synonyms:
C9orf108 EDG3 S1P receptor 3 S1P3 S1PR3_HUMAN Sphingosine 1-phosphate receptor 3 (S1P3) | Sphingosine 1-phosphate receptor Edg-3
Type:
G Protein-Coupled Receptor (GPCR)
Mol. Mass.:
42278.13
Organism:
Homo sapiens (Human)
Description:
Q99500
Residue:
378
  
Inhibitor
Name:
BDBM50147706
Synonyms:
CHEMBL114584 | [3-Amino-3-hydroxymethyl-5-(4-octyl-phenyl)-pentyl]-phosphonic acid
Type:
Small organic molecule
Emp. Form.:
C20H36NO4P
Mol. Mass.:
385.4779
SMILES:
CCCCCCCCc1ccc(CCC(N)(CO)CCP(O)(O)=O)cc1
: