Target
Uracil nucleotide/cysteinyl leukotriene receptor
Ligand
BDBM50580105
Substrate
Meas. Tech.
ChEMBL_2147045 (CHEMBL5031391)
EC50
26330±n/a nM
Citation
 Nguyen, PDoan, PRimpilainen, TKonda Mani, SMurugesan, AYli-Harja, OCandeias, NRKandhavelu, M Synthesis and Preclinical Validation of Novel Indole Derivatives as a GPR17 Agonist for Glioblastoma Treatment. J Med Chem 64:10908-10918 (2021)  
Target
Name:
Uracil nucleotide/cysteinyl leukotriene receptor
Synonyms:
GPR17 | GPR17_HUMAN
Type:
PROTEIN
Mol. Mass.:
41013.71
Organism:
Homo sapiens (Human)
Description:
ChEMBL_1353471
Residue:
367
  
Inhibitor
Name:
BDBM50580105
Synonyms:
CHEMBL5086989
Type:
Small organic molecule
Emp. Form.:
C13H10Cl2O4
Mol. Mass.:
301.122
SMILES:
OC(=O)CCC1=C(Cc2cc(Cl)cc(Cl)c12)C(O)=O
: