Target
Mu-type opioid receptor
Ligand
BDBM50580203
Substrate
Meas. Tech.
ChEMBL_2147437 (CHEMBL5031783)
EC50
537±n/a nM
Citation
 Chakraborty, SDiBerto, JFFaouzi, ABernhard, SMGutridge, AMRamsey, SZhou, YProvasi, DNuthikattu, NJilakara, RNelson, MNFAsher, WBEans, SOWilson, LLChintala, SMFilizola, Mvan Rijn, RMMargolis, EBRoth, BLMcLaughlin, JPChe, TSames, DJavitch, JAMajumdar, S A Novel Mitragynine Analog with Low-Efficacy Mu Opioid Receptor Agonism Displays Antinociception with Attenuated Adverse Effects. J Med Chem 64:13873-13892 (2021)  
Target
Name:
Mu-type opioid receptor
Synonyms:
M-OR-1 MOR-1 MUOR1 Mu opiate receptor OPRM1 hMOP | mu-type opioid receptor isoform MOR-1
Type:
G Protein-Coupled Receptor (GPCR)
Mol. Mass.:
44789.51
Organism:
Homo sapiens (Human)
Description:
P35372
Residue:
400
  
Inhibitor
Name:
BDBM50580203
Synonyms:
CHEMBL5089366
Type:
Small organic molecule
Emp. Form.:
C27H32N2O6
Mol. Mass.:
480.5528
SMILES:
[H][C@@]12C[C@@H]([C@H](CC)CN1CC[C@@]1(O)C2=Nc2ccc(-c3ccoc3)c(OC)c12)C(=C/OC)\C(=O)OC
: