Target
Ectonucleotide pyrophosphatase/phosphodiesterase family member 2
Ligand
BDBM192943
Substrate
Meas. Tech.
ChEMBL_2147909 (CHEMBL5032255)
Ki
30±n/a nM
Citation
 Deng, XSalgado-Polo, FShao, TXiao, ZVan, RChen, JRong, JHaider, AShao, YJosephson, LPerrakis, ALiang, SH Imaging Autotaxin  J Med Chem 64:15053-15068 (2021)  
Target
Name:
Ectonucleotide pyrophosphatase/phosphodiesterase family member 2
Synonyms:
ATX Autotaxin (ATX) ENPP2 Ectonucleotide Pyrophosphatase/Phosphodiesterase 2 (ENPP2) Extracellular lysophospholipase D PDNP2
Type:
Enzyme
Mol. Mass.:
99007.13
Organism:
Homo sapiens (Human)
Description:
Q13822
Residue:
863
  
Inhibitor
Name:
BDBM192943
Synonyms:
US10526329, Compound 139 | US9670204, 138 2-((2-ethyl-6-(4-(2-(3-hydroxyazetidin-1-yl)-2-oxoethyl)piperazin-1-yl)imidazo[1,2-a]pyridin-3-yl)(methyl)amino)-4-(4-fluorophenyl)thiazole-5-carbonitrile
Type:
Small organic molecule
Emp. Form.:
C29H31FN8O2S
Mol. Mass.:
574.672
SMILES:
CCc1nc2ccc(cn2c1N(C)c1nc(c(s1)C#N)-c1ccc(F)cc1)N1CCN(CC(=O)N2CC(O)C2)CC1
: