Target
Ectonucleotide pyrophosphatase/phosphodiesterase family member 2
Ligand
BDBM50580257
Substrate
Meas. Tech.
ChEMBL_2147909 (CHEMBL5032255)
Ki
32±n/a nM
Citation
 Deng, XSalgado-Polo, FShao, TXiao, ZVan, RChen, JRong, JHaider, AShao, YJosephson, LPerrakis, ALiang, SH Imaging Autotaxin  J Med Chem 64:15053-15068 (2021)  
Target
Name:
Ectonucleotide pyrophosphatase/phosphodiesterase family member 2
Synonyms:
ATX Autotaxin (ATX) ENPP2 Ectonucleotide Pyrophosphatase/Phosphodiesterase 2 (ENPP2) Extracellular lysophospholipase D PDNP2
Type:
Enzyme
Mol. Mass.:
99007.13
Organism:
Homo sapiens (Human)
Description:
Q13822
Residue:
863
  
Inhibitor
Name:
BDBM50580257
Synonyms:
CHEMBL5078471
Type:
Small organic molecule
Emp. Form.:
C30H32F2N8OS
Mol. Mass.:
590.69
SMILES:
CCc1nc2ccc(cn2c1N(C)c1nc(c(s1)C#N)-c1ccc(F)cc1)N1CCN(CC(=O)N2CC[C@H](F)C2)CC1
: