Target
Sphingosine 1-phosphate receptor 3
Ligand
BDBM50148425
Substrate
Meas. Tech.
ChEBML_201333
IC50
1.2±n/a nM
Citation
 Hale, JJDoherty, GToth, LMills, SGHajdu, RKeohane, CARosenbach, MMilligan, JShei, GJChrebet, GBergstrom, JCard, DForrest, MSun, SYWest, SXie, HNomura, NRosen, HMandala, S Selecting against S1P3 enhances the acute cardiovascular tolerability of 3-(N-benzyl)aminopropylphosphonic acid S1P receptor agonists. Bioorg Med Chem Lett 14:3501-5 (2004)  
Target
Name:
Sphingosine 1-phosphate receptor 3
Synonyms:
C9orf108 EDG3 S1P receptor 3 S1P3 S1PR3_HUMAN Sphingosine 1-phosphate receptor 3 (S1P3) | Sphingosine 1-phosphate receptor Edg-3
Type:
G Protein-Coupled Receptor (GPCR)
Mol. Mass.:
42278.13
Organism:
Homo sapiens (Human)
Description:
Q99500
Residue:
378
  
Inhibitor
Name:
BDBM50148425
Synonyms:
CHEMBL119873 | [3-(3-Fluoro-4-octyloxy-benzylamino)-propyl]-phosphonic acid
Type:
Small organic molecule
Emp. Form.:
C18H31FNO4P
Mol. Mass.:
375.4152
SMILES:
CCCCCCCCOc1ccc(CNCCCP(O)(O)=O)cc1F
: