Target
Nuclear receptor subfamily 2 group E member 1
Ligand
BDBM60973
Substrate
Meas. Tech.
ChEMBL_2148634 (CHEMBL5033032)
EC50
40000±n/a nM
Citation
 Faudone, GBischoff-Kont, IRachor, LWillems, SZhubi, RKaiser, AChaikuad, AKnapp, SFürst, RHeering, JMerk, D Propranolol Activates the Orphan Nuclear Receptor TLX to Counteract Proliferation and Migration of Glioblastoma Cells. J Med Chem 64:8727-8738 (2021)  
Target
Name:
Nuclear receptor subfamily 2 group E member 1
Synonyms:
NR2E1 Nuclear receptor TLX TLX hTll
Type:
PROTEIN
Mol. Mass.:
42606.25
Organism:
Homo sapiens
Description:
ChEMBL_104473
Residue:
385
  
Inhibitor
Name:
BDBM60973
Synonyms:
(2R)-1-(1-naphthalenyloxy)-3-(propan-2-ylamino)-2-propanol;hydrochloride (2R)-1-naphthalen-1-yloxy-3-(propan-2-ylamino)propan-2-ol;hydrochloride MLS001333595 cid_66366
Type:
Small organic molecule
Emp. Form.:
C16H21NO2
Mol. Mass.:
259.3434
SMILES:
CC(C)NC[C@@H](O)COc1cccc2ccccc12
: