Target
Nuclear receptor subfamily 2 group E member 1
Ligand
BDBM50580568
Substrate
Meas. Tech.
ChEMBL_2148634 (CHEMBL5033032)
EC50
83000±n/a nM
Citation
 Faudone, GBischoff-Kont, IRachor, LWillems, SZhubi, RKaiser, AChaikuad, AKnapp, SFürst, RHeering, JMerk, D Propranolol Activates the Orphan Nuclear Receptor TLX to Counteract Proliferation and Migration of Glioblastoma Cells. J Med Chem 64:8727-8738 (2021)  
Target
Name:
Nuclear receptor subfamily 2 group E member 1
Synonyms:
NR2E1 Nuclear receptor TLX TLX hTll
Type:
PROTEIN
Mol. Mass.:
42606.25
Organism:
Homo sapiens
Description:
ChEMBL_104473
Residue:
385
  
Inhibitor
Name:
BDBM50580568
Synonyms:
CHEMBL5088115
Type:
Small organic molecule
Emp. Form.:
C16H20O3
Mol. Mass.:
260.3282
SMILES:
CC(C)OCC(O)COc1cccc2ccccc12
: