Target
C-type lectin domain family 4 member M
Ligand
BDBM50580861
Substrate
Meas. Tech.
ChEMBL_2149161 (CHEMBL5033559)
IC50
26500±n/a nM
Citation
 Chakroun, KTaouai, MPorkolab, VLuczkowiak, JSommer, RCheneau, CMathiron, DBen Maaouia, MAPilard, SAbidi, RMullié, CFieschi, FCragg, PJHalary, FDelgado, RBenazza, M Low-Valent Calix[4]arene Glycoconjugates Based on Hydroxamic Acid Bearing Linkers as Potent Inhibitors in a Model of Ebola Virus Cis-Infection and HCMV-gB-Recombinant Glycoprotein Interaction with MDDC Cells by Blocking DC-SIGN. J Med Chem 64:14332-14343 (2021)  
Target
Name:
C-type lectin domain family 4 member M
Synonyms:
CD209 antigen-like protein 1 CD209L1 CD_antigen=CD299 CLEC4M DC-SIGN2 Dendritic cell-specific ICAM-3-grabbing non-integrin 2 Liver/lymph node-specific ICAM-3-grabbing non-integrin
Type:
PROTEIN
Mol. Mass.:
45339.05
Organism:
Homo sapiens
Description:
ChEMBL_105433
Residue:
399
  
Inhibitor
Name:
BDBM50580861
Synonyms:
CHEMBL5079779
Type:
Small organic molecule
Emp. Form.:
C148H216N32O40
Mol. Mass.:
3083.489
SMILES:
COC(=O)CNC(=O)CN(Cc1cn(CCCOc2c3Cc4cc(cc(Cc5cc(cc(Cc6cc(cc(Cc2cc(c3)C(C)(C)C)c6OCCCn2cc(CN(CC(=O)NCC(=O)OC)C(=O)CCCCCn3cc(CO[C@@H]6O[C@@H](C)[C@@H](O)[C@@H](O)[C@@H]6O)nn3)nn2)C(C)(C)C)c5OCCCn2cc(CN(CC(=O)NCC(=O)OC)C(=O)CCCCCn3cc(CO[C@@H]5O[C@@H](C)[C@@H](O)[C@@H](O)[C@@H]5O)nn3)nn2)C(C)(C)C)c4OCCCn2cc(CN(CC(=O)NCC(=O)OC)C(=O)CCCCCn3cc(CO[C@@H]4O[C@@H](C)[C@@H](O)[C@@H](O)[C@@H]4O)nn3)nn2)C(C)(C)C)nn1)C(=O)CCCCCn1cc(CO[C@@H]2O[C@@H](C)[C@@H](O)[C@@H](O)[C@@H]2O)nn1
: