Target
C-type lectin domain family 4 member M
Ligand
BDBM50580865
Substrate
Meas. Tech.
ChEMBL_2149161 (CHEMBL5033559)
IC50
2480000±n/a nM
Citation
 Chakroun, KTaouai, MPorkolab, VLuczkowiak, JSommer, RCheneau, CMathiron, DBen Maaouia, MAPilard, SAbidi, RMullié, CFieschi, FCragg, PJHalary, FDelgado, RBenazza, M Low-Valent Calix[4]arene Glycoconjugates Based on Hydroxamic Acid Bearing Linkers as Potent Inhibitors in a Model of Ebola Virus Cis-Infection and HCMV-gB-Recombinant Glycoprotein Interaction with MDDC Cells by Blocking DC-SIGN. J Med Chem 64:14332-14343 (2021)  
Target
Name:
C-type lectin domain family 4 member M
Synonyms:
CD209 antigen-like protein 1 CD209L1 CD_antigen=CD299 CLEC4M DC-SIGN2 Dendritic cell-specific ICAM-3-grabbing non-integrin 2 Liver/lymph node-specific ICAM-3-grabbing non-integrin
Type:
PROTEIN
Mol. Mass.:
45339.05
Organism:
Homo sapiens
Description:
ChEMBL_105433
Residue:
399
  
Inhibitor
Name:
BDBM50580865
Synonyms:
CHEBI:42548 | CHEMBL1232862
Type:
Small organic molecule
Emp. Form.:
C6H12O5
Mol. Mass.:
164.1565
SMILES:
C[C@@H]1O[C@@H](O)[C@@H](O)[C@H](O)[C@@H]1O
: