Target
Muscarinic acetylcholine receptor M3
Ligand
BDBM50581193
Substrate
Meas. Tech.
ChEMBL_2150070 (CHEMBL5034532)
Ki
0.199526±n/a nM
Target
Name:
Muscarinic acetylcholine receptor M3
Synonyms:
ACM3_HUMAN Cholinergic, muscarinic M3 Muscarinic receptor M3 | RecName: Full=Muscarinic acetylcholine receptor M3
Type:
Enzyme
Mol. Mass.:
66151.03
Organism:
Homo sapiens (Human)
Description:
P20309
Residue:
590
  
Inhibitor
Name:
BDBM50581193
Synonyms:
CHEMBL5084383
Type:
Small organic molecule
Emp. Form.:
C35H34Cl2FN3O7S
Mol. Mass.:
730.63
SMILES:
COc1ccc(cc1OC)[C@H](Cc1c(Cl)c[n+]([O-])cc1Cl)OC(=O)c1ccc(CN(C(=O)O[C@H]2CN3CCC2CC3)c2cccc(F)c2)s1
: