Target
Muscarinic acetylcholine receptor M3
Ligand
BDBM50581201
Substrate
Meas. Tech.
ChEMBL_2150070 (CHEMBL5034532)
Ki
0.316228±n/a nM
Target
Name:
Muscarinic acetylcholine receptor M3
Synonyms:
ACM3_HUMAN Cholinergic, muscarinic M3 Muscarinic receptor M3 | RecName: Full=Muscarinic acetylcholine receptor M3
Type:
Enzyme
Mol. Mass.:
66151.03
Organism:
Homo sapiens (Human)
Description:
P20309
Residue:
590
  
Inhibitor
Name:
BDBM50581201
Synonyms:
CHEMBL5085717
Type:
Small organic molecule
Emp. Form.:
C37H36Cl2F3N3O7S
Mol. Mass.:
794.664
SMILES:
CC(C)Oc1cc(ccc1OC(F)F)[C@H](Cc1c(Cl)c[n+]([O-])cc1Cl)OC(=O)c1ccc(CN(C(=O)O[C@H]2CN3CCC2CC3)c2ccccc2F)s1
: